{"text_format":"1","workbook":"xlsx","n_sheets":3,"sheets":["Modelo","Valores","Dados"],"not_rendered":{"charts":0,"images":1,"macros":1,"external_links":0,"defined_names":1,"comments":1,"pivot_tables":0},"unopened":[],"bounds":{"document_bytes":16777216,"sheet_cells":100000,"rows_first":2000,"rows_last":500,"rows_between":2000,"halvings":0,"cell_chars":16384,"cell_head_chars":4096},"cells_cut":0,"cells_raw":0,"read":"whole","date_system":"1900"}

{"sheet":"Modelo","index":0,"n_rows":54,"n_cols":2,"rows_kept":54,"cut":false,"hidden":false,"merged":[[34,1,34,2],[25,1,25,2],[26,1,26,2],[27,1,27,2],[28,1,28,2],[29,1,29,2],[30,1,30,2],[32,1,32,2],[31,1,31,2],[33,1,33,2],[35,1,35,2],[53,0,53,2],[47,0,50,2],[43,0,46,2],[39,0,42,2],[52,0,52,2],[51,0,51,2],[5,0,8,2],[0,0,4,2],[23,0,23,2],[24,1,24,2],[9,0,9,2],[11,0,16,2],[17,0,22,2]]}
[]
[]
[]
[]
[]
["GOVERNO DO ESTADO DO ESPÍRITO SANTO\nSECRETARIA DE ESTADO DE GESTÃO E RECURSOS HUMANOS\nAv. Governador Bley, 236, Ed. Fábio Ruschi, Centro – Vitória/ES. Tel.: (27) 3636-5260\nANEXO III DO CONTRATO "]
[]
[]
[]
["TERMO DE ADESÃO"]
[]
["TERMO DE ADESÃO AO CONTRATO 021/2017 CELEBRADO ENTRE A SECRETARIA DE ESTADO DE GESTÃO E RECURSOS HUMANOS - SEGER E A EMPRESA Telemar Norte Leste S/A, publicado no D.O.E em 30/11/2017, visando à PRESTAÇÃO DE SERVIÇOS DE TELEFONIA COM O OBJETIVO DE OPERACIONALIZAR A REDE TELEFÔNICA CORPORATIVA DO GOVERNO DO ESTADO DO ESPÍRITO SANTO.\n"]
[]
[]
[]
[]
[]
["A/O (NOME DO ÓRGÃO), com sede __________ (endereço completo) __________, inscrita no CNPJ sob o nº. ____________________ neste ato representado(a) pelo _________ (condição jurídica do representante)__________ Sr. __________(nome, nacionalidade, estado civil e profissão, CPF)__________, vem efetivar a adesão a este Contrato, por execução indireta, nos termos da Lei n.º 8.666, de 21 de junho de 1993 e alterações posteriores, de acordo com os termos do processo n.º 74843877 e Pregão n.º 032/2017, partes integrantes deste instrumento, independentemente de transcrição juntamente com a proposta apresentada pela contratada em 09/10/2017, ficando porém, ressalvadas como não transcritas as condições nela estipuladas que contrariem as disposições do contrato."]
[]
[]
[]
[]
[]
["DOTAÇÃO ORÇAMENTÁRIA E VALOR"]
["Selecione o Órgão:","Selecione aqui:"]
[null,"Telefonia Fixa"]
["Nº do Empenho:","Preencher"]
["Atividade(Programa de trabalho)",{"$f":"IFERROR(VLOOKUP($B$25,Dados!$A$1:$D$84,2,FALSE),\"\")","v":""}]
["Elemento de Despesa(Natureza de despesa)",{"$f":"IFERROR(VLOOKUP($B$25,Dados!$A$1:$D$84,3,FALSE),\"\")","v":""}]
["Fonte:",{"$f":"IFERROR(VLOOKUP($B$25,Dados!$A$1:$D$84,4,FALSE),\"\")","v":""}]
["Lote I (24 meses)",{"$f":"IFERROR(VLOOKUP($B$25,Dados!$A$1:$G$84,5,FALSE),\"\")","v":""}]
["Valor por Extenso:",{"$f":"IFERROR(Extenso_Valor(B31),\"\")","v":""}]
["Lote II (24 meses)",{"$f":"IFERROR(VLOOKUP($B$25,Dados!$A$1:$G$84,6,FALSE),\"\")","v":""}]
["Valor por Extenso:",{"$f":"IFERROR(Extenso_Valor(B33),\"\")","v":""}]
["Valor Contratado Total (24 meses)",{"$f":"VLOOKUP($B$25,Valores!$B$1:$C$54,2,FALSE)","v":"Valor Contratado (24 meses)"}]
["Valor por Extenso:",{"$f":"IFERROR(Extenso_Valor(B35),\"\")","v":""}]
[]
[" Cidade e data"]
[]
["________________________________________\nDIRIGENTE DO ÓRGÃO"]
[]
[]
[]
["________________________________________\nDAYSE MARIA OSLEGHER LEMOS\nSecretária de Estado de Gestão e Recursos Humanos - SEGER\n"]
[]
[]
[]
["_________________________________________\nTELEMAR NORTE LESTE S/A"]
[]
[]
[]
[]
["OBS: DESIGNAÇÃO DE FISCAL DE CONTRATO CORPORATIVO\nModelo de Termo de Designação disponível em www.compras.es.gov.br, Gestão de Contratos – Modelos de Formulários, “Formulário 25 - Ato de designação Contrato Corporativo”, conforme preceitua a Portaria SEGER/PGE/SECONT Nº 049-R, publicada em 25/08/2010."]
["Os dados \"Atividade\", \"Elemento de despesa\" e \"Fonte\" apresentados automaticamente neste formulário correspondem aos inicialmente informados pelo órgão na fase interna de licitação. \nCaso necessário poderão ser alterados na fase atual.\n"]

{"sheet":"Valores","index":1,"n_rows":55,"n_cols":3,"rows_kept":55,"cut":false,"hidden":true,"merged":[]}
["ITEM","Selecione aqui:","Valor Contratado (24 meses)"]
[1,"ADERES",17914.38]
[2,"AGERH",27397.59]
[3,"APEES",33548.28]
[4,"ARSP",32328.26]
[5,"CBMES",235183.03]
[6,"CEASA",78951.41]
[7,"CETURB",57747.74]
[8,"DER-ES",93580.06]
[9,"DETRAN",886579.06]
[10,"DFP",807026.77]
[11,"DIO",26835.47]
[12,"ESESP",25765.65]
[13,"FAMES",20769.080000000002]
[14,"FAPES",26547.59]
[15,"HPM(DSPMES)",30120.45]
[16,"IASES",209754.44]
[17,"IDAF",454218.87]
[18,"IEMA",78217.990000000005]
[19,"IJSN",65689.789999999994]
[20,"INCAPER",371288.9]
[21,"IOPES",52886.94]
[22,"IPAJM",99006.28]
[23,"IPEM",36167.019999999997]
[24,"JUCEES",89369.67]
[25,"PCES",574859.46]
[26,"PGE",73154.63]
[27,"PMES",1003457.97]
[28,"PROCON",62354.37]
[29,"PRODEST",72794.559999999998]
[30,"RTV",83989.37]
[31,"SCV",22196.98]
[32,"SCM",25414.77]
[33,"SEAG",46766.42]
[34,"SECOM",30204.69]
[35,"SECONT",17507.98]
[36,"SECTI",27577.19]
[37,"SECULT",64676.12]
[38,"SEDES",34686.74]
[39,"SEDH",30240.45]
[40,"SEDU",1805464.91]
[41,"SEDURB",25408.66]
[42,"SEFAZ",469662.95]
[43,"SEG",122618.51]
[44,"SEGER",56077.13]
[45,"SEJUS",414705.97]
[46,"SEP",47176.45]
[47,"SESA",627831.04000000004]
[48,"SESP",538450.56999999995]
[49,"SETADES",58983]
[50,"SESPORT",64221.95]
[51,"SETOP",29334.27]
[52,"SETUR",23267.89]
[53,"VG",53410.38]
["TOTAL",null,{"$f":"SUM(C2:C54)","v":10363390.100000003}]

{"sheet":"Dados","index":2,"n_rows":85,"n_cols":7,"rows_kept":85,"cut":false,"hidden":true,"merged":[]}
["Órgão","Programa de trabalho","Natureza de despesa","Fonte","Lote I","Lote II","Total"]
["ADERES","10.30.205.23.122.0800.2070","3.3.90.39.58","0101000000",17914.38,null,17914.38]
["AGERH","10.41.202.18.122.0018.2070","3.3.90.39.58","0101000000",27397.59,null,27397.59]
["APEES","13.122.0169.2070","3.3.90.39.58","0101000000",33548.28,null,33548.28]
["ARSP","04.122.0800.2070","3.3.90.39.58","0271",27007.24,5321.02,32328.26]
["CEASA","20.122.0006.2070.00",33903958,"0271000000",78951.41,null,78951.41]
["CBMES",2900,339039,101,200595.35,34587.68,235183.03]
["CETURB"," ",null," ",49470.43,8277.31,57747.74]
["DER-ES","Preencher","Preencher","Preencher",93580.06,null,93580.06]
["DETRAN","06.122.0800.2070","3.3.90.39.58","0271000001",886579.06,null,886579.06]
["DFP"," 10.06.101.03.092.00582357/10.06.901.03.092.0058.2357","3.3.90.39.58","0101000000/0271000000",753297.72,53729.05,807026.77]
["DIO","10.28.202.04.122.0552.2070","3.3.90.39.58","0271000000",26835.47,null,26835.47]
["ESESP","0412200032070","3.3.9039.58","0101000000",25765.65,null,25765.65]
["FAMES","10.42.201.12.122.0800.2070","33.90.39.58","0102000001",20769.080000000002,null,20769.080000000002]
["FAPES","10.32.202.19.122.0017.2070","3.390.39.58","0101000000",26547.59,null,26547.59]
["HPM(DSPMES)","10.45.105.06.302.000","3.3.90.39.58","0101000000",30120.45,null,30120.45]
["IASES","Preencher","33.90.39-27/3.3.90.39-58","0101000000",209754.44,null,209754.44]
["IDAF",2070,"3.3.90.39.58","0671/0271/0101",454218.87,null,454218.87]
["IEMA","Preencher","3.3.90.39.58","0101",78217.990000000005,null,78217.990000000005]
["IJSN","10.27.201.04.122.0562.2070","33.90.39.58","0101000000",65689.789999999994,null,65689.789999999994]
["INCAPER","10.31.202.20.122.0800.2070/10.31.202.20.571.0006.3394/10.31.202.20.606.0006.6390","3.3.90.39.58","0101000000,02771000000,0671000000,0272000000,0672000000",371288.9,null,371288.9]
["IOPES","10.35.208.04.122.0595.2070",339039,"0101000000",52886.94,null,52886.94]
["IPAJM","20.60.201.09.122.0002.2070",33903958,"0270000000",96380.4,2625.88,99006.28]
["IPEM","Preencher","Preencher","0272",30698.17,5468.85,36167.019999999997]
["JUCEES","10.22.202.23.122.0013.2070","3.3.90.39.58","0271",89369.67,null,89369.67]
["PCES",612200042070,"3.3.90.39.00","0101000000",543006.26,31853.200000000001,574859.46]
["PGE","Preencher","3.3.90.39.58","0101000000",73154.63,null,73154.63]
["PMES","10.45.103.06.122.0004.2070","3.3.90.39.58","0101000000",883140.47,120317.5,1003457.97]
["PROCON","Preencher","3.3.90.39.58",101,62354.37,null,62354.37]
["PRODEST","Preencher","3.3.90.39.58","0271000000",60452.39,12342.17,72794.559999999998]
["RTV","2412202982070",339039,"0101",83989.37,null,83989.37]
["SCV","Preencher","3.3.90.39.58","0101000000",22196.98,null,22196.98]
["SCM","10.10.102.06.122.0004.2070","3.3.90.39.58","0101000000",25414.77,null,25414.77]
["SEAG","20.122.0800.2070","3.3.90.39","0101000000",46766.42,null,46766.42]
["SECOM","10.10.104.04.122.0204.2070","3.3.90.39.58","0101000000",30204.69,null,30204.69]
["SECONT","Preencher","3.3.90.39.58","0101000000",7752.44,9755.5400000000009,17507.98]
["SECTI","10.32.101.19.122.0800.2070","3.3.90.39.58","0101000000",27577.19,null,27577.19]
["SECULT","Preencher","3.3.90.39.58","0101000000",64676.12,null,64676.12]
["SEDES ","23.122.0800.2070","3.3.90.39.00","0101",34686.74,null,34686.74]
["SEDH","Preencher","3.3.90.39.58","0101000000",30240.45,null,30240.45]
["SEDU","12.122.0721.2175","3.3.90.39.58","0131000001",1805464.91,null,1805464.91]
["SEDURB","1512208002.070","3.3.90.39.58","0101000000",25408.66,null,25408.66]
["SEFAZ","10.22.101.04.122.0615.2070","3.3.90.39.58","0101000000",396570.77,73092.179999999993,469662.95]
["SEG","0412208002070","3.3.90.39.58","0101000000",122618.51,null,122618.51]
["SEGER","10.28.101.04.122.0800.2070","3.3.90.39.58","0101000000",56077.13,null,56077.13]
["SEJUS","10.46.101.14.122.0021.2070","3.3.90.39.58","0101000000",414705.97,null,414705.97]
["SEP","10.27.101.04.122.0616.2070","3.3.90.39.58","0101000000",47176.45,null,47176.45]
["SESA",null,null,null,388394.98,239436.06,627831.04000000004]
["SESA SEDE-ENSEADA DO SUÁ","20.44.901.10.122.0800.2070","3.3.90.39.58",104000000]
["SESA SEDE- BENTO FERREIRA","20.44.901.10.122.0800.2070","3.3.90.39.58",104000000]
["SESA SEDE-UNIDADES FORA","20.44.901.10.122.0800.2070","3.3.90.39.58",104000000]
["SESA SEDE -SAMU 192","20.44901.10.122.0800.2070","3.3.90.39.58",104000000]
["FARMACIA CIDADÃ VILA VELHA","20.44.901.10.122.0800.2070","3.3.90.39.58",104000000]
["FARMACIA CIDADÃ SERRA","20.44.901.10.122.0800.2070","3.3.90.39.58",104000000]
["HEMOES VITÓRIA","20.44.901.10.302.0030.2720","3.3.90.39.58",104000000]
["HEMONUCLEO COLATINA","20.44.901.10.302.0030.2720","3.3.90.39.58",104000000]
["HEMONUCLEO SÃO MATEUS","20.44.901.10.302.0030.2720","3.3.90.39.58",104000000]
["HEMONUCLEO LINHARES","20.44.901.10.302.0030.2720","3.3.90.39.58",104000000]
["HEINSG","20.44.901.10.302.0030.2184","3.3.90.39.58",104000000]
["HESL","20.44.901.10.302.0030.2184","3.3.90.39.58",104000000]
["HEIMARA","20.44.901.10.302.0030.2184","3.3.90.39.58",104000000]
["HESVV","20.44.901.10.302.0030.2184","3.3.90.39.58",104000000]
["HEABF","20.44.901.10.302.0030.2184","3.3.90.39.58",104000000]
["CREFES","20.44.901.10.302.0030.2184","3.3.90.39.58",104000000]
["SRSV/CRE METROPOLITANO ","20.44.901..10.122.0031.2252","3.3.90.39.58",104000000]
["HEPF","20.44.901.10.302.0030.2184","3.3.90.39.58",104000000]
["HEDS","20.44.901.10.302.0030.2184","3.3.90.39.58",104000000]
["HEAC","20.44.901.10.302.0030.2184","3.3.90.39.58",104000000]
["SRSCI","20.44.901..10.122.0031.2252","3.3.90.39.58",104000000]
["CAPAAC","20.44.901.10.302.0030.2184","3.3.90.39.58",104000000]
["HESJC","20.44.901.10.302.0030.2184","3.3.90.39.58",104000000]
["UIJM","20.44.901.10.302.0030.2184","3.3.90.39.58",104000000]
["SRSC ","20.44.901.10.122.0031.2252","3.3.90.39.58",104000000]
["HEMSA","20.44.901.10.302.0030.2184","3.3.90.39.58",104000000]
["SRSSM/CRE SÃO MATEUS/FARM.CIDADÃ SÃO MATEUS","20.44.901.10.122.0031.2252","3.3.90.39.58",104000000]
["HERAS ","20.44.901.10.302.0030.2184","3.3.90.39.58",104000000]
["HEDRC","20.44.901.10.302.0030.2184","3.3.90.39.58",104000000]
["HEJSN","20.44.901.10.302.0030.2184","3.3.90.39.58",104000000]
["SESP","061220800.20.70","3.3.90.39.58","0101000000",299014.51,239436.06,538450.56999999995]
["SESPORT","10.39.101.27.122.0159.2070","3.3.90.39","0101000000",64221.95,null,64221.95]
["SETADES","47.101.08.122.0800.2070, 47.101.11.334.0414.2867,  47.904.08.244.0860.2008","3.3.90.58","0101000000/0133000000/0159000021/4101000000",58983,null,58983]
["SETOP","10.35.101.26.122.0800.2070","3.39.0.39.58","0101000000",29334.27,null,29334.27]
["SETUR","37.101.23.122.0800.2070","3.3.90.339.58","0101000000",23267.89,null,23267.89]
["VG","2070 e 2069","3.3.90.39.58","0101000000",44393.96,9016.42,53410.38]
[null,null,null,null,{"$f":"SUM(E2:E84)","v":9518131.1800000016},{"$f":"SUM(F2:F84)","v":845258.92},10363390.100000003]