{"text_format":"1","workbook":"xlsx","n_sheets":3,"sheets":["Modelo","Plan2","Plan3"],"not_rendered":{"charts":0,"images":1,"macros":1,"external_links":0,"defined_names":1,"comments":1,"pivot_tables":0},"unopened":[],"bounds":{"document_bytes":16777216,"sheet_cells":100000,"rows_first":2000,"rows_last":500,"rows_between":2000,"halvings":0,"cell_chars":16384,"cell_head_chars":4096},"cells_cut":0,"cells_raw":0,"read":"whole","date_system":"1900"}

{"sheet":"Modelo","index":0,"n_rows":53,"n_cols":2,"rows_kept":53,"cut":false,"hidden":false,"merged":[[26,1,26,2],[27,1,27,2],[28,1,28,2],[29,1,29,2],[52,0,52,2],[46,0,49,2],[42,0,45,2],[38,0,41,2],[51,0,51,2],[30,1,30,2],[31,1,31,2],[33,1,33,2],[32,1,32,2],[34,1,34,2],[5,0,8,2],[17,0,17,2],[0,0,4,2],[24,0,24,2],[25,1,25,2],[9,0,9,2],[11,0,16,2],[18,0,23,2]]}
[]
[]
[]
[]
[]
["GOVERNO DO ESTADO DO ESPÍRITO SANTO\nSECRETARIA DE ESTADO DE GESTÃO E RECURSOS HUMANOS\nAv. Governador Bley, 236, Ed. Fábio Ruschi, Centro – Vitória/ES. Tel.: (27) 3636-5260\nANEXO III DO CONTRATO"]
[]
[]
[]
["TERMO DE ADESÃO"]
[]
["TERMO DE ADESÃO AO CONTRATO 018/2017 CELEBRADO ENTRE A SECRETARIA DE ESTADO DE GESTÃO E RECURSOS HUMANOS - SEGER E A EMPRESA LINK CARD ADMINISTRADORA DE BENEFICIOS EIRELI - EPP, publicado no D.O.E em 19/10/2017, visando à PRESTAÇÃO DE SERVIÇO DE GERENCIAMENTO DO ABASTECIMENTO DE COMBUSTÍVEL DOS VEÍCULOS OFICIAIS E OUTROS EQUIPAMENTOS PERTENCENTES AO GOVERNO DO ESTADO DO ESPÍRITO SANTO, ENVOLVENDO A IMPLANTAÇÃO E OPERAÇÃO DE UM SISTEMA DE GESTÃO DE FROTA INFORMATIZADO, VIA INTERNET, COM A AQUISIÇÃO DE COMBUSTÍVEIS, LUBRIFICANTES E OUTROS MATERIAIS FORNECIDOS PELA REDE DE POSTOS CREDENCIADOS.\n"]
[]
[]
[]
[]
[]
[]
["A/O (NOME DO ÓRGÃO), com sede __________ (endereço completo) __________, inscrita no CNPJ sob o nº. ____________________ neste ato representado(a) pelo _________ (condição jurídica do representante)__________ Sr. __________(nome, nacionalidade, estado civil e profissão, CPF)__________, vem efetivar a adesão a este Contrato, por execução indireta, nos termos da Lei n.º 8.666, de 21 de junho de 1993 e alterações posteriores, de acordo com os termos do processo n.º 76053733 e Pregão n.º 0014/2017, partes integrantes deste instrumento, independentemente de transcrição juntamente com a proposta apresentada pela contratada em 04/08/2017, ficando porém, ressalvadas como não transcritas as condições nela estipuladas que contrariem as disposições do contrato."]
[]
[]
[]
[]
[]
["DOTAÇÃO ORÇAMENTÁRIA E VALOR"]
["Selecione o Órgão:","AGERH"]
[null,"Abastecimento"]
["Nº do Empenho:"]
["Atividade(Programa de trabalho)",{"$f":"IFERROR(VLOOKUP($B$26,Plan3!$A$2:$I$55,3,FALSE),\"\")","v":"10.41.202.18.122.00108.2070"}]
["Elemento de Despesa(Natureza de despesa)",{"$f":"IFERROR(VLOOKUP($B$26,Plan3!$A$2:$I$55,4,FALSE),\"\")","v":"3.3.90.30.58/3.3.90.30.59"}]
["Fonte:",{"$f":"IFERROR(VLOOKUP($B$26,Plan3!$A$2:$I$55,5,FALSE),\"\")","v":"0101/0350"}]
["Valor estimado (24 meses)",{"$f":"IFERROR(VLOOKUP(B26,Plan2!A1:D54,2,FALSE),\"\")","v":105438.99}]
["Taxa de Administração:  (-) 3,6%",{"$f":"IFERROR(B32*(-0.036),\"\")","v":-3795.8036400000001}]
["Valor Contratado: (Valor estimado + taxa de administração)",{"$f":"IFERROR(B32+B33,\"\")","v":101643.18636000001}]
["Valor por Extenso:",{"$f":"IFERROR(Extenso_Valor(B34),\"\")","v":"cento e um mil, seiscentos e quarenta e três reais e dezenove centavos"}]
[]
[" Cidade e data"]
[]
["________________________________________\nDIRIGENTE DO ÓRGÃO"]
[]
[]
[]
["________________________________________\nSECRETÁRIO/SEGER"]
[]
[]
[]
["_________________________________________\nLINK CARD ADMINISTRADORA DE BENEFÍCIOS EIRELLI EPP"]
[]
[]
[]
[]
["OBS: DESIGNAÇÃO DE FISCAL DE CONTRATO CORPORATIVO\nModelo de Termo de Designação disponível em www.compras.es.gov.br, Gestão de Contratos – Modelos de Formulários, “Formulário 25 - Ato de designação Contrato Corporativo”, conforme preceitua a Portaria SEGER/PGE/SECONT Nº 049-R, publicada em 25/08/2010."]
["Os dados \"Atividade\", \"Elemento de despesa\" e \"Fonte\" apresentados automaticamente neste formulário correspondem aos inicialmente informados pelo órgão na fase interna de licitação. \nCaso necessário poderão ser alterados na fase atual.\n"]

{"sheet":"Plan2","index":1,"n_rows":55,"n_cols":6,"rows_kept":55,"cut":false,"hidden":true,"merged":[]}
["Selecione Aqui:","Informado (24 meses)","Taxa (-3,6)","Valor com Taxa (-3,60%)"]
["ADERES",71854.570000000007,{"$f":"B2*(-0.036)","v":-2586.7645200000002},69267.80548000001,null,{"$f":"B2+C2","v":69267.80548000001}]
["AGERH",105438.99,{"$f":"B3*(-0.036)","v":-3795.8036400000001},101643.18636000001]
["APEES",15000,-540,14460]
["ARSP",132944.35999999999,-4785.9969599999995,128158.36303999998]
["CBMES",2975026.5,-107100.954,2867925.5460000001]
["CEASA",97298.74,-3502.7546400000001,93795.985360000006]
["CETURB",171570.31,-6176.5311599999995,165393.77883999998]
["DER",477643.91,-17195.180759999999,460448.72923999996]
["DETRAN",633000,-22788,610212]
["DFP",305637.11,-11002.935959999999,294634.17403999995]
["DIO",41037.06,-1477.3341599999999,39559.725839999999]
["ESESP",35610.1,-1281.9635999999998,34328.136399999996]
["FAMES",26142.45,-941.12819999999999,25201.321800000002]
["FAPES",19976.75,-719.1629999999999,19257.587]
["HPM",73594.820000000007,-2649.4135200000001,70945.406480000005]
["IASES",1291576.9099999999,-46496.768759999992,1245080.1412399998]
["IDAF",1700000,-61199.999999999993,1638800]
["IEMA",817068.25,-29414.456999999999,787653.79299999995]
["IJSN",23986.38,-863.50968,23122.870320000002]
["INCAPER",1450065,-52202.34,1397862.66]
["IOPES",213600,-7689.5999999999995,205910.39999999999]
["IPAJM",29639.23,-1067.0122799999999,28572.217719999997]
["IPEM",335962.45,-12094.6482,323867.80180000002]
["JUCEES",14380.32,-517.69151999999997,13862.628479999999]
["PCES",10800000,-388799.99999999994,10411200]
["PGE",142319.21,-5123.4915599999995,137195.71844]
["PMES",30329441.329999998,-1091859.8878799998,29237581.442119997]
["PROCON",36227.14,-1304.1770399999998,34922.962959999997]
["PRODEST",33757.160000000003,-1215.25776,32541.902240000003]
["RTV",124776.16,-4491.9417599999997,120284.21824]
["SCM",784168.98,-28230.083279999999,755938.89671999996]
["SCV",90641.42,-3263.0911199999996,87378.328880000001]
["SEDH",300000,-10800,289200]
["SEAG",282423.34999999998,-10167.240599999999,272256.10939999996]
["SECOM",181603.86,-6537.7389599999988,175066.12103999997]
["SECONT",78000,-2808,75192]
["SECTTI",65000,-2340,62660]
["SECULT",137063.38,-4934.2816800000001,132129.09831999999]
["SEDES",89682.44,-3228.5678399999997,86453.872159999999]
["SEDU",123174.01,-4434.2643599999992,118739.74563999999]
["SEDURB",107414.2,-3866.9111999999996,103547.28879999999]
["SEFAZ",480097.12,-17283.496319999998,462813.62367999996]
["SEG",392179.05,-14118.445799999998,378060.6042]
["SEGER",93309.119999999995,-3359.1283199999998,89949.991679999992]
["SEJUS",5280000,-190080,5089920]
["SEP",72621.679999999993,-2614.3804799999994,70007.299519999986]
["SESA",2893115.86,-104152.17095999999,2788963.6890399996]
["SESP",857341.79,-30864.30444,826477.48556000006]
["SESPORT",84462.7,-3040.6571999999996,81422.042799999996]
["SETADES",570000,-20520,549480]
["SETOP",41771.9,-1503.7883999999999,40268.111599999997]
["SETUR",87133.93,-3136.8214799999996,83997.108519999994]
["VG",200910.03,-7232.7610799999993,193677.26892]
["Total",{"$f":"SUM(B2:B54)","v":65816690.029999986},null,{"$f":"SUM(D2:D54)","v":63447289.188919999}]

{"sheet":"Plan3","index":2,"n_rows":55,"n_cols":9,"rows_kept":55,"cut":false,"hidden":true,"merged":[[0,1,0,4],[0,5,0,8]]}
["ÓRGÃO","Abastecimento",null,null,null,"Taxa de Adm"]
[null,"Unidade Orçamentária","Programa de Trabalho","Natureza de Despesa","Fonte","Unidade Orçamentária","Programa de Trabalho","Natureza de Despesa","Fonte"]
["ADERES",30205,"10.30.205.23.122.0800.2070","3.3.90.30.58/3.3.90.30.59",101000000,30205,"10.30.205.23.122.0800.2070","3.3.90.30.58/3.3.90.30.59",101000000]
["AGERH",410202,"10.41.202.18.122.00108.2070","3.3.90.30.58/3.3.90.30.59","0101/0350",410202,"10.41.202.18.122.0018.2070","3.3.90.39.03","0101/0350"]
["APEES",40102,1312201692070,"3.3.90.30.58 e 30.59",101000000,40102,1312201692070,"3.3.90.39.75",101000000]
["ARSP",30207,412208002070,"3.3.90.30",271,30207,412208002070,"3.3.90.30",271]
["CBMES",45904,"10.45.904.06.182.0059.2900","3.3.90.58",159000014,45904,"10.45.904.06.182.0059.2900","3.3.90.39.03",159000014]
["CEASA",310203,201220006207000,"339030-01",271000000,310203,201220006207000,"339039-03",271000000]
["CETURB","Recursos Próprios","Recursos Próprios","Recursos Próprios","Recursos Próprios","Recursos Próprios","Recursos Próprios","Recursos Próprios","Recursos Próprios"]
["DER",35201,"10.35.201.26.122.0800.2070",339030,"101/271",35201,"10.35.201.26.122.0800.2070",339039,101]
["DETRAN/ES",45202,612208002070,"3.3.90.30.00",271000001,45202,612208002070,"3.3.90.30.00",271000001]
["DFP",6901,6.9010309200582304E+16,"3.3.90.30.01",271000000,6901,6.9010309200582304E+16,"3.3.90.39.05",271000000]
["DIO",28202,"10.28.202.04.122.0552.2070",339030,271,28202,"10.28.202.04.122.0552.2070",339039,271]
["ESESP",280201,"10.28.201.04.122.0003.2070","3.3.90.30.58/3.3.90.30.59",101000000,280201,"10.28.201.04.122.0003.2070","3.3.90.39.03",101000000]
["FAMES",420201,1212208002070,"33.90.30",102000001,420201,1212208002070,"33.90.30",102000001]
["FAPES",32202,1912200172070,"3.3.90.30.58",101,32202,1912200172070,"3.3.90.39.03",101]
["HPM",45105,"10.45.105.06.302.0004.2790","3.3.90.30.58",101000000,45105,"10.45.105.06.302.0004.2790","3.3.90.30.59",101000000]
["IASES",48201,"20.48.201.14.122.0800.2070","3.3.90.30.58 e 3.3.90.30.59",101000000,48201,"20.48.201.14.122.0800.2070","3.3.90.30.58 e 3.3.90.30.59",101000000]
["IDAF",31201,"10.31.201.20.122.0800.2070","3.3.90.30.58/3.3.90.30.59/3.3.90.30.39","0271000000/0101000000",31201,"10.31.201.20.122.0800.2070","3.3.90.39.03","0271000000/0101000000"]
["IEMA",41201,"10.41.201.18.122.0800.2070","3.3.90.30.58",101,41201,"10.41.201.18.122.0800.2070","3.3.90.39.03",101]
["IJSN",27201,"10.27.201.04.122.0562.2070","3.3.90.30.58",101000000,27201,"10.27.201.04.122.0562.2070","3.3.90.30.58",101000000]
["INCAPER",31202,"10.31202.20.122.0800/2070","3.3.90.30.01 e 3.3.90.30.58","0101000000/0271000000",31202,"10.31202.20.122.0800/2070","3.3.90.39.03","0101000000/0271000000"]
["IOPES",35208,"10.35.208.04.122.0595.2101","3.3.90.30.58",10100000,350208,"10.35.208.04.122.0595.2101","3.3.90.39.03",10100000]
["IPAJM",60201,"20.60.201.09.122.0002.2070","3.3.90.30.03",27000000,60201,"20.60.201.09.122.0002.2070","3.3.90.30.03",27000000]
["IPEM",30203,"10.30.203.22.665.0068.23.15/10.30.203.22.122.0068.2070","3390.30.58 E 33.90.30.59",272,30203,"10.30.203.22.665.0068.23.15/10.30.203.22.122.0068.2070","33.90.39.25",272]
["JUCEES",22202,"10.22.202.23.122.00","3.3.90.30.58/59",271,22202,"10.22.202.23.122.00","3.3.90.30.39",271]
["PCES",450102,612200420700000,"3.3.90.30",101000000,450102,612200420700000,"3.3.90.39",101000000]
["PGE",16101,312207402070,339030,101,16101,312207402070,339047,101]
["PMES",45103,4.5103061220004198E+17,"3.3.90.30.01/58/59",1011000000,45103,4.5103061220004198E+17,"3.3.90.39.03",1011000000]
["PROCON",460202,"10.46.202.14.122.0068.2070",339030,101,460202,"10.46.202.14.122.0068.2070",339030,101]
["PRODEST",280203,412206502070,339030,"0271000000 e 010100000",280203,412206502070,339030,"0271000000 e 010100000"]
["RTV",100201,2412202982070,"33.90.30.00",101,100201,2412202982070,"33.90.30.00",101]
["SCM",10102,6122000420700000,"3.3.90.30.58/59/39",10100000,10102,6122000420700000,"3.3.90.30.58/59/39",10100000]
["SCV",10101,"10.10.101.04.122.0019.2121",33903058,101,10101,"10.10.101.04.122.0019.0019",33903058,101]
["SEAG",31101,"10.31.101.20.122.0800.2070","3.3.90.30.58",101000000,31101,"10.31.101.20.122.0800.2070","3.3.90.39.00",101000000]
["SECOM",10104,"10.10.104.04.122.0204.2070","3.3.90.30.58",101000000,10104,"10.10.104.04.122.0204.2070","3.3.90.30.58",101000000]
["SECONT",100103,1.01010304122018E+19,"33903039/58/59",101000000,100103,1.01010304122018E+19,"339039-05",101000000]
["SECTTI",32101,"32.32.101.19.122.0800.2070","3.3.90.30.58",101000000,32101,"32.32.101.19.122.0800.2070","3.3.90.39.03",101000000]
["SECULT",40101,"40.101.13.122.0800.2070","3.3.90.30.58",10100000,40101,"40.101.13.122.0800.2070","3.3.90.30.58",10100000]
["SEDH",48101,"10.48.101.14.122.0800.2070","3.3.90.30",101000000,48101,"10.48.101.14.122.0800.2070","3.3.90.30",101000000]
["SEDES",30101,2312208002070,"3.3.90.30.00",101000000,30101,2312208002070,"3.3.90.39.00",101000000]
["SEDU",42101,1212207212175,"3.3.90.30.01",131,42101,1212207212175,"3.3.90.39",131]
["SEDURB",36101,1512208002070,"3.3.90.30.58",101000000,36101,1512208002070,"3.3.90.39",101000000]
["SEFAZ",22101,"10.22.101.04.122.0615.2070","3.3.90.30.58/3.3.90.30.59",101000000,22101,"10.22.101.04.122.0615.2070","3.3.90.39.03",101000000]
["SEG",10109,"10.10109.04.122.0800.2070","3.3.90.30.58",101000000,10109,"10.10109.04.122.0800.2070","3.3.90.39.03",101000000]
["SEGER",28101,"10.28.101.04.122.0800.2070","3.3.90.30.58/ 3.3.90.30.01",101000000,28101,"10.28.101.04.122.0800.2070","3.3.90.39.03",101000000]
["SEJUS",46101,"10.46.101.14.122.0021.2070","3.3.90.30.00",101000000,46101,"10.46.101.14.122.0021.2070","3.3.90.30.00",101000000]
["SEP",27101,"10.27.101.04.122.0616.2070","3.3.90.30",101000000,27101,"10.27.101.04.122.0616.2070","3.3.90.30",101000000]
["SESP",45101,612208002070,"3.3.90.30.01/58/59",101,45101,612208002070,"3.3.90.39.03",101]
["SESPORT",39101,"39.101.27.122.0159.2070","3.3.90.30.03",101000000,39101,"39.101.27.122.0159.2070","3.3.90.30.03",101000000]
["SETADES",470101,"47.101.08.122.0800.2070/47","3.3.90.30.01/39/58/59","0101000000/0133000000",470101,"47.101.08.11.0800.2070/47.10","3.3.90.39.00","0101000000/0133000000"]
["SETOP",35101,"10.35.101.26.122.0800.2070","3.3.90.30.58",101000000,35101,"10.35.101.26.122.0800.2070","3.3.90.30.58",101000000]
["SETUR",37101,3.7101231220800198E+17,"3.3.90.30.58",101000000,37101,3.7101231220800198E+17,"3.3.90.39.79",101000000]
["VG","19101 e 19901","10.10.101.04.122.0800.2070/10.19.901.14.422.0599.2069","3.3.90.30.58",101,"19101 e 19901","10.10.101.04.122.0800.2070/10.19.901.14.422.0599.2069","3.3.90.30.58",101]
["SESA"]