{"text_format":"1","workbook":"xlsx","n_sheets":3,"sheets":["Modelo","Plan2","Plan3"],"not_rendered":{"charts":0,"images":1,"macros":1,"external_links":0,"defined_names":1,"comments":1,"pivot_tables":0},"unopened":[],"bounds":{"document_bytes":16777216,"sheet_cells":100000,"rows_first":2000,"rows_last":500,"rows_between":2000,"halvings":0,"cell_chars":16384,"cell_head_chars":4096},"cells_cut":0,"cells_raw":0,"read":"whole","date_system":"1900"}

{"sheet":"Modelo","index":0,"n_rows":54,"n_cols":3,"rows_kept":54,"cut":false,"hidden":false,"merged":[[5,0,8,2],[17,0,17,2],[0,0,4,2],[24,0,24,2],[25,1,25,2],[9,0,9,2],[11,0,16,2],[18,0,23,2],[35,1,35,2],[34,1,34,2],[53,0,53,2],[47,0,50,2],[43,0,46,2],[39,0,42,2],[52,0,52,2]]}
[]
[]
[]
[]
[]
["GOVERNO DO ESTADO DO ESPÍRITO SANTO\nSECRETARIA DE ESTADO DE GESTÃO E RECURSOS HUMANOS\nAv. Governador Bley, 236, Ed. Fábio Ruschi, Centro – Vitória/ES. Tel.: (27) 3636-5260\nANEXO III DO CONTRATO"]
[]
[]
[]
["TERMO DE ADESÃO"]
[]
["TERMO DE ADESÃO AO CONTRATO nº 019/2017 CELEBRADO ENTRE A SECRETARIA DE ESTADO DE GESTÃO E RECURSOS HUMANOS – SEGER E A EMPRESA TICKET SOLUÇÕES HDFGT S/A, inscrita n.º CNPJ/MF sob o n.º 03.506.307/0001-57, PUBLICADO NO D.O.E EM 03/11/2017, VISANDO a CONTRATAÇÃO DE EMPRESA ESPECIALIZADA NO GERENCIAMENTO DE TRANSAÇÕES COMERCIAIS COM REDE DE EMPRESA CREDENCIADAS OBJETIVANDO A PRESTAÇÃO DE SERVIÇOS DE MANUTENÇÃO PREVENTIVA E CORRETIVA, COMPREENDENDO A REALIZAÇÃO DE ORÇAMENTO DE MATERIAIS E SERVIÇOS ESPECIALIZADOS DE MANUTENÇÃO, PARA ATENDIMENTO DA FROTA DE VEÍCULOS E EQUIPAMENTOS OPERACIONAIS. TODAS AS TRANSAÇÕES DEVEM SER OPERACIONALIZADAS POR MEIO DE CARTÃO MAGNÉTICO, MICROPROCESSADO OU TECNOLOGIA SUPERIOR, INDIVIDUALIZADO POR VEÍCULO, POR INTERMÉDIO DE IMPLANTAÇÃO E OPERAÇÃO DE SISTEMA INFORMATIZADO VIA WEB, PRÓPRIO DA CONTRATADA.\n"]
[]
[]
[]
[]
[]
[]
["A/O (NOME DO ÓRGÃO), com sede __________(endereço completo)__________, inscrita no CNPJ sob o nº. ____________________ neste ato representado(a) pelo _________(condição jurídica do representante)__________ Sr. __________(nome, nacionalidade, estado civil e profissão, CPF), vem efetivar a adesão a este Contrato, por execução indireta, nos termos das leis n.º 8.666, de 21 de junho de 1993 e n.º 8883, de 08 de junho de 1994, de acordo com os termos do processo n.º 70575380 e Pregão n.º 027/2016, partes integrantes deste instrumento, independentemente  de transcrição juntamente com a proposta apresentada pela contratada em 11/09/2017, ficando porém, ressalvadas como não transcritas as condições nela estipuladas que contrariem as disposições do contrato."]
[]
[]
[]
[]
[]
["DOTAÇÃO ORÇAMENTÁRIA E VALOR"]
["Selecione o Órgão:","Selecione Aqui:"]
[null,"Serviço","Peça"]
["Nº do Empenho:"]
["Atividade(Programa de trabalho)",{"$f":"IFERROR(VLOOKUP($B$26,Plan3!$A$2:$I$31,7,FALSE),\"\")","v":""},{"$f":"IFERROR(VLOOKUP($B$26,Plan3!$A$1:$I$31,3,FALSE),\"\")","v":""}]
["Elemento de Despesa(Natureza de despesa)",{"$f":"IFERROR(VLOOKUP($B$26,Plan3!$A$2:$I$31,8,FALSE),\"\")","v":""},{"$f":"IFERROR(VLOOKUP($B$26,Plan3!$A$1:$I$31,4,FALSE),\"\")","v":""}]
["Fonte:",{"$f":"IFERROR(VLOOKUP($B$26,Plan3!$A$2:$I$31,9,FALSE),\"\")","v":""},{"$f":"IFERROR(VLOOKUP($B$26,Plan3!$A$1:$I$31,5,FALSE),\"\")","v":""}]
["Valor estimado (24 meses)",{"$f":"IFERROR(VLOOKUP($B$26,Plan2!A1:E30,3,FALSE),\"\")","v":"Serviço (24 Meses)"},{"$f":"IFERROR(VLOOKUP($B$26,Plan2!A1:C30,2,FALSE),\"\")","v":"Peças (24 meses)"}]
["Taxa de Administração:  (-) 15%",{"$f":"IFERROR(B32*(-0.15),\"\")","v":""},{"$f":"IFERROR(C32*(-0.15),\"\")","v":""}]
["Valor Contratado: (Valor estimado + taxa de administração)",{"$f":"IFERROR(B32+B33,\"\")","v":""},{"$f":"IFERROR(C32+C33,\"\")","v":""}]
["Valor total do contrato (Valor Peça + Serviço)",{"$f":"SUM(B34:C34)","v":0}]
["Valor por Extenso:",{"$f":"IFERROR(Extenso_Valor(B35),\"\")","v":""}]
[]
[" Cidade e data"]
[]
["________________________________________\nDIRIGENTE DO ÓRGÃO"]
[]
[]
[]
["________________________________________\nDAYSE MARIA OSLEGHER LEMOS\nSecretária de Estado de Gestão e Recursos Humanos - SEGER\n"]
[]
[]
[]
["_________________________________________\nTICKET SOLUÇÕES HDFGT S/A"]
[]
[]
[]
[]
["OBS: DESIGNAÇÃO DE FISCAL DE CONTRATO CORPORATIVO\nModelo de Termo de Designação disponível em www.compras.es.gov.br, Gestão de Contratos – Modelos de Formulários, “Formulário 25 - Ato de designação Contrato Corporativo”, conforme preceitua a Portaria SEGER/PGE/SECONT Nº 049-R, publicada em 25/08/2010."]
["Os dados \"Atividade\", \"Elemento de despesa\" e \"Fonte\" apresentados automaticamente neste formulário correspondem aos inicialmente informados pelo órgão na fase interna de licitação. \nCaso necessário poderão ser alterados na fase atual.\n"]

{"sheet":"Plan2","index":1,"n_rows":31,"n_cols":7,"rows_kept":31,"cut":false,"hidden":false,"merged":[]}
["Selecione Aqui:","Peças (24 meses)","Serviço (24 Meses)","Peças com taxa(24 meses)","Mo com taxa (24 Meses)"]
["ADERES",11634.647431133888,8001.7875720691873,{"$f":"B2*0.85","v":9889.4503164638045},{"$f":"C2*0.85","v":6801.519436258809},null,{"$f":"B2+C2","v":19636.435003203074}]
["AGERH",10836.14,2705.78,{"$f":"B3*0.85","v":9210.7189999999991},2299.913]
["APEES",9477.3402459791832,3468.8401135288555,8055.7392090823059,2948.5140964995271]
["CBMES",1431812.1772028995,1270156.7924529426,1217040.3506224644,1079633.2735850012]
["CETURB",28846.140327868852,24556.616393442619,24519.219278688524,20873.123934426225]
["DER",18438.544014665447,20114.324546287804,15672.76241246563,17097.175864344634]
["DETRAN",224518.6371806169,155202.30000000002,190840.84160352437,131921.95500000002]
["HPM",59981.4,40779.303919597987,50984.19,34662.408331658291]
["FAMES",20000,14000,17000,11900]
["IASES",20000,10000,17000,8500]
["IDAF",730379.01482714666,796322.08376470592,620822.16260307468,676873.77119999996]
["IEMA",350000,220000,297500,187000]
["INCAPER",757234.29363719421,996469.83139471291,643649.14959161507,846999.35668550595]
["IPEM",32037,19807.400000000001,27231.45,16836.29]
["JUCEES",4600,3500,3910,2975]
["PCES",2555473.971052533,1968257.3043317972,2172152.8753946531,1673018.7086820276]
["PGE",25860.16351648351,25451.282637362641,21981.138989010982,21633.590241758244]
["PMES",8871781.6878389139,6292841.7389204046,7541014.4346630769,5348915.4780823439]
["PROCON",12926.83,4000,10987.8055,3400]
["RTV",5000,2216.6562786434461,4250,1884.1578368469291]
["SECONT",27485.450612991768,19526.596962488569,23362.633021043002,16597.607418115284]
["SECULT",40000,16000,34000,13600]
["SEDU",166748.88,19357.919999999998,141736.54800000001,16454.231999999996]
["SEFAZ",120000,90000,102000,76500]
["SEJUS",2029142.5786746226,1036902.934477612,1724771.1918734291,881367.49430597015]
["SESA",3116565.92,1596697.46,2649081.0319999997,1357192.841]
["SESP",315034.8820659754,262782.0766823751,267779.64975607907,223364.76518001882]
["SESPORT",15652.76214857143,9450.5965714285703,13304.847826285715,8033.0070857142846]
["SETADES",55459.839999999997,37100,47140.863999999994,31535]
["Total",{"$f":"SUM(B2:B30)","v":21066928.300777592},{"$f":"SUM(C2:C30)","v":14965669.627019402},{"$f":"SUM(D2:D30)","v":17906889.055660959},{"$f":"SUM(E2:E30)","v":12720819.182966493}]

{"sheet":"Plan3","index":2,"n_rows":31,"n_cols":9,"rows_kept":31,"cut":false,"hidden":true,"merged":[[0,1,0,4],[0,5,0,8]]}
["ÓRGÃO","Peça",null,null,null,"Serviço"]
[null,"Unidade Orçamentária","Programa de Trabalho","Natureza de Despesa","Fonte","Unidade Orçamentária","Programa de Trabalho","Natureza de Despesa","Fonte"]
["ADERES",30205,2312208002070,"33.90.30.39","0101000000",30205,2312208002070,"33.90.39.19","0101000000"]
["AGEHR",410202,1812200182070,"3.3.90.30.39","0101",410202,1812200182070,"3.3.90.39.19","0101"]
["APEES",40102,1312201692070,"3.3.90.30.39","0101000000",40102,1312201692070,"3.3.90.39.19","0101000000"]
["CBMES",45904,"10459040618200592900",339030,"0159000014",45904,"10459040618200592900",339039,"0159000014"]
["CETURB","Recursos Próprios","Recursos Próprios","Recursos Próprios","Recursos Próprios","Recursos Próprios","Recursos Próprios","Recursos Próprios","Recursos Próprios"]
["DER",35201,"10.35.201.26.122.080","3.3.90.30.39","0101000000 ",35201,"10.35.201.26.122.080","3.3.90.39.19","0101000000 "]
["DETRAN",45202,"0612208002070","3.3.90.30.39","0271000001",45202,"0612208002070","3.3.90.39.19","0271000001"]
["HPM",45105,"06.302.0004.2790","3.3.90.30.39","0101000000 ",45105,"06.302.0004.2790","3.3.90.39.19","0101000000 "]
["FAMES",420201,"10.42.201.12.122.080","33.90.30.39","0102000001",420201,"10.42.201.12.122.080","33.90.39.19","0102000001"]
["IASES",48201,"20.48.201.14.122.080","3.3.90.30.39","0101000000",48201,"20.48.201.14.122.080","3.3.90.39.19","0101000000"]
["IDAF",31201,"10.31.201.20.122.080","3.3.90.30.39","0271000000/01010 ",31201,"10.31.201.20.122.080","3.3.90.39.19","0271000000/01010 "]
["IEMA",41201,"18.122.0800.2070","3.3.90.30.39","0101",41201,"18.122.0800.2070","3.3.90.39.19","0101"]
["INCAPER",31202,"10.31202.20.122.0800.2070","3.3.90.30.39","0101000000, 027100",31202,"10.31202.20.122.0800.2070","3.3.90.39.19 ","0101000000, 027100"]
["IPEM",30203,"10.30.203.22.122.00 ","33.90.30","0272 ",30203,"10.30.203.22.122.00 ","33.90.39","0272 "]
["JUCEES",22202,"10.22.202.23.122.00","3.3.90.30.39","0271 ",22202,"10.22.202.23.122.00","3.3.90.39.19","0271 "]
["PCES",45102,"0612200042070","3.3.90.30.00","0101000000",45102,"0612200042070","3.3.90.39.00","0101000000"]
["PGE",16,"07402070 ",33903039,"0101",16,"07402070 ",33903919,"0101"]
["PMES",45103,"45.103.061222224.2 ","3.3.90.30.39","0101000000",45103,"45.103.061222224.2 ","3.3.90.39.19 ","0101000000"]
["PROCON",460202,"10.46.202.14.122.0068.2070",339030,"010100000",460202,"10.46.202.14.122.0068.2070",33903919,"010100000"]
["RTV",10201,"24.122.0298.2070","33.90.30.39","0101000000",10201,"24.122.0298.2070","33.90.39.00 ","0101000000"]
["SECONT",10103,"0412201892070 ","339030-39","0101",10103,"0412201892070 ","339039-19","0101"]
["SECULT",40101,"10.40101.13.392.002","3.3.90.39.39","0101.000000",40101,"10.40101.13.392.002","3.3.90.39.19 ","0101.000000"]
["SEDU",420101,"12.122.0721.2177","3.3.90.30.39","0102",420101,"12.122.0721.2177","3.3.90.39.19 ","0102"]
["SEFAZ",22101,"10.22.101.04.122.0615.2070","3.3.90.30.39","0101000000 ",22101,"10.22.101.04.122.0615.2070","3.3.90.39.19","0101000000 "]
["SEJUS",46101,"10.46.101.14.122.0021.2070","3.3.90.30.39","0101000000",46101,"10.46.101.14.122.0021.2070","3.3.90.39.20","0101000000"]
["SESA"]
["SESP",45101,"45.101.061220800.20","3.3.90.30.39","0101000000",45101,"45.101.061220800.20","3.3.90.39.20","0101000000"]
["SESPORT",39101,"10.39.101.27.122.01","3.3.90.30","0101000000",39101,"10.39.101.27.122.01","3.3.90.39 ","0101000000"]
["SETADES",470101,"08.11.0800.2070","33903001/39/58/59","0101000000",470101,"08.11.0800.2070","3.3.90.39.19","0101000000"]