{"text_format":"1","workbook":"xlsx","n_sheets":2,"sheets":["Formulário de Ação","Banco de Dados"],"not_rendered":{"charts":0,"images":1,"macros":1,"external_links":0,"defined_names":12,"comments":1,"pivot_tables":0},"unopened":[],"bounds":{"document_bytes":16777216,"sheet_cells":100000,"rows_first":2000,"rows_last":500,"rows_between":2000,"halvings":0,"cell_chars":16384,"cell_head_chars":4096},"cells_cut":0,"cells_raw":0,"read":"whole","date_system":"1900"}

{"sheet":"Formulário de Ação","index":0,"n_rows":65,"n_cols":12,"rows_kept":65,"cut":false,"hidden":false,"merged":[[35,1,36,1],[0,1,7,12],[8,1,8,12],[20,2,20,8],[18,1,18,12],[14,2,14,8],[33,1,33,12],[24,2,24,4],[26,2,31,11],[24,6,24,8],[10,11,11,11],[10,2,11,8],[56,2,60,11],[54,2,54,7],[13,2,13,11],[70,14,71,16],[38,2,38,7],[46,2,46,7],[62,2,62,7],[64,2,68,11],[22,2,22,8],[20,9,20,10],[35,2,36,7],[15,2,16,11],[48,2,52,11],[40,2,44,11]]}
[]
[]
[]
[]
[]
[]
[]
[]
[null,"DADOS DO PROGRAMA"]
[]
[null," Nome do Programa",null,null,null,null,null,null,null,null,"Área Estratégica",{"$f":"IFERROR(INDEX('Banco de Dados'!E:E,MATCH(C11,'Banco de Dados'!C:C,0)),\"\")","v":""}]
[]
[]
[null,"Órgão Responsável",{"$f":"IFERROR(INDEX('Banco de Dados'!J:J,MATCH(C11,'Banco de Dados'!C:C,0)),\"\")","v":""}]
[]
[null,"Público Alvo",{"$f":"IFERROR(INDEX('Banco de Dados'!F:F,MATCH(C11,'Banco de Dados'!C:C,0)),\"\")","v":""}]
[]
[]
[null,"DADOS DA AÇÃO"]
[]
{"$rows_left_out":46}
{"sheet":"Banco de Dados","index":1,"n_rows":137,"n_cols":27,"rows_kept":137,"cut":false,"hidden":false,"merged":[]}
["Código do Programa","Colunas1","Nome do programa","Nome do Programa2","Área Estratégica","Público Alvo","Objetivo","Situação do Programa","Código da UO","Nome do òrgão","UO Pograma","Colunas2","Tipo de Ação",null,"Identificador de Quantidade",".","Unidade de Medida",null,"Esfera Orçamentária",null,"UO Ação",null,"Função","Subfunções","código da UO",null,"UO"]
["02","-",{"$f":"CONCATENATE(Tabela2[[#This Row],[Código do Programa]],Tabela2[[#This Row],[Colunas1]],Tabela2[[#This Row],[Nome do Programa2]])","v":"02-PREVIDÊNCIA SOCIAL "},"PREVIDÊNCIA SOCIAL ","GESTÃO PÚBLICA INOVADORA","SERVIDORES PÚBLICOS ESTADUAIS E PENSIONISTAS","GARANTIR O ATENDIMENTO DE PRECEITOS LEGAIS E ADMINISTRATIVOS RELATIVOS À ÁREA DE PREVIDÊNCIA SOCIAL, ASSEGURANDO A CONCESSÃO DE BENEFÍCIOS A SERVIDORES INATIVOS E PENSIONISTAS, VINCULADOS OU NÃO AO REGIME PRÓPRIO DE PREVIDÊNCIA DO ESTADO.","EM ANDAMENTO",60201,"60 - INSTITUTO DE PREVIDÊNCIA DOS SERVIDORES DO ESTADO DO ESPÍRITO SANTO","INSTITUTO DE PREVIDÊNCIA DOS SERVIDORES DO ESTADO DO ESPÍRITO SANTO",".","ATIVIDADE",null,"Acumulativo",null,"Hectares ",null,"10 - ORÇAMENTO FISCAL",null,{"$f":"CONCATENATE(Y2,Z2,AA2,)","v":"01101 - ASSEMBLEIA LEGISLATIVA DO ESTADO DO ESPÍRITO SANTO"},".","1 - LEGISLATIVA","031 – Ação Legislativa","01101"," - ","ASSEMBLEIA LEGISLATIVA DO ESTADO DO ESPÍRITO SANTO"]
[10,"-",{"$f":"CONCATENATE(Tabela2[[#This Row],[Código do Programa]],Tabela2[[#This Row],[Colunas1]],Tabela2[[#This Row],[Nome do Programa2]])","v":"10-PROMOÇÃO, AUTONOMIA E DEFESA DOS DIREITOS DAS MULHERES"},"PROMOÇÃO, AUTONOMIA E DEFESA DOS DIREITOS DAS MULHERES","DESENVOLVIMENTO SOCIAL E DIREITOS HUMANOS","MULHERES","PROPORCIONAR ÀS MULHERES FERRAMENTAS PARA SUA AUTONOMIA E MECANISMO DE DEFESA DE SEUS DIREITOS, PROPORCIONANDO A IGUALDADE DE GÊNEROS.","EM ANDAMENTO",48101,"48 - SECRETARIA DE ESTADO DE DIREITOS HUMANOS \n","SECRETARIA DE ESTADO DE DIREITOS HUMANOS ",".","OPERAÇÃO ESPECIAL",null,"Somatório",null,"Km",null,"20 - ORÇAMENTO DA SEGURIDADE SOCIAL",null,{"$f":"CONCATENATE(Y3,Z3,AA3,)","v":"02101 - TRIBUNAL DE CONTAS DO ESTADO DO ESPÍRITO SANTO"},".","2 - JUDICIÁRIA","032 – Controle Externo","02101"," - ","TRIBUNAL DE CONTAS DO ESTADO DO ESPÍRITO SANTO"]
[14,"-",{"$f":"CONCATENATE(Tabela2[[#This Row],[Código do Programa]],Tabela2[[#This Row],[Colunas1]],Tabela2[[#This Row],[Nome do Programa2]])","v":"14-FORTALECIMENTO DO SISTEMA DE ATENDIMENTO SOCIOEDUCATIVO"},"FORTALECIMENTO DO SISTEMA DE ATENDIMENTO SOCIOEDUCATIVO","DESENVOLVIMENTO SOCIAL E DIREITOS HUMANOS","ADOLESCENTE EM CUMPRIMENTO DE MEDIDAS SOCIOEDUCATIVAS","ASSEGURAR OS DIREITOS INDIVIDUAIS  DO ADOLESCENTE EM CUMPRIMENTO DE MEDIDA SOCIOEDUCATIVA À LUZ DO SISTEMA NACIONAL DE ATENDIMENTO SOCIOEDUCATIVO E DO ESTATUTO DA CRIANÇA E DO ADOLESCENTE.","EM ANDAMENTO",48201,"48 - SECRETARIA DE ESTADO DE DIREITOS HUMANOS \n","INSTITUTO DE ATENDIMENTO SOCIOEDUCATIVO DO ESPÍRITO SANTO",".","PROJETO",null,null,null,"Km² ",null,"30 - ORÇAMENTO DE INVESTIMENTO",null,"03101 - TRIBUNAL DE JUSTIÇA DO ESTADO DO ESPÍRITO SANTO",".","3 - ESSENCIAL À JUSTIÇA","061 – Ação Judiciária","03101"," - ","TRIBUNAL DE JUSTIÇA DO ESTADO DO ESPÍRITO SANTO"]
[17,"-",{"$f":"CONCATENATE(Tabela2[[#This Row],[Código do Programa]],Tabela2[[#This Row],[Colunas1]],Tabela2[[#This Row],[Nome do Programa2]])","v":"17-FORTALECIMENTO DA PESQUISA CIENTÍFICA, TECNOLÓGICA E DA INOVAÇÃO"},"FORTALECIMENTO DA PESQUISA CIENTÍFICA, TECNOLÓGICA E DA INOVAÇÃO","EDUCAÇÃO PARA O FUTURO","ESTUDANTES DE GRADUAÇÃO E PÓS-GRADUAÇÃO, PROFESSORES E ESTUDANTES DA REDE PÚBLICA DE ENSINO, PESQUISADORES E EMPREENDEDORES VINCULADOS AO SISTEMA DE C,T&I","CONECTAR O ECOSSISTEMA CAPIXABA DE CIÊNCIA, TECNOLOGIA E INOVAÇÃO AOS DESAFIOS SOCIOECONÔMICOS E AMBIENTAIS.","EM ANDAMENTO",32101,"32 - SECRETARIA DE ESTADO DA CIÊNCIA, TECNOLOGIA, INOVAÇÃO, EDUCAÇÃO PROFISSIONAL E DESENVOLVIMENTO ECONONÔMICO","SECRETARIA DE ESTADO DE CIÊNCIA, TECNOLOGIA, INOVAÇÃO E EDUCAÇÃO PROFISSIONAL",".",null,null,null,null,"M²",null,null,null,"03901 - FUNDO ESPECIAL DO PODER JUDICIÁRIO DO ESTADO DO ESPÍRITO SANTO",".","4 - ADMINISTRAÇÃO","062 – Defesa do Interesse Público no Processo Judiciário","03901"," - ","FUNDO ESPECIAL DO PODER JUDICIÁRIO DO ESTADO DO ESPÍRITO SANTO"]
[18,"-",{"$f":"CONCATENATE(Tabela2[[#This Row],[Código do Programa]],Tabela2[[#This Row],[Colunas1]],Tabela2[[#This Row],[Nome do Programa2]])","v":"18-FORTALECIMENTO DO SISTEMA ESTADUAL DE MEIO AMBIENTE E RECURSOS HÍDRICOS"},"FORTALECIMENTO DO SISTEMA ESTADUAL DE MEIO AMBIENTE E RECURSOS HÍDRICOS","AGRICULTURA E MEIO AMBIENTE","SOCIEDADE EM GERAL","SUSTENTAR, IMPLEMENTAR E FORTALECER AS POLÍTICAS ESTADUAIS DE MEIO AMBIENTE E RECURSOS HÍDRICOS, PROMOVER O USO RACIONAL DA ÁGUA E A AMPLIAÇÃO DA SEGURANÇA HÍDRICA, INCLUSIVE COM A IMPLEMENTAÇÃO DE AÇÕES DE PREVENÇÃO E ADAPTAÇÃO AOS EFEITOS DAS MUDANÇAS CLIMÁTICAS.","EM ANDAMENTO",41902,"41 - SECRETARIA DE ESTADO DE MEIO AMBIENTE E RECURSOS HÍDRICOS \n","FUNDO ESTADUAL DE RECURSOS HÍDRICOS E FLORESTAIS DO ESPÍRITO SANTO",".",null,null,null,null,"M³",null,null,null,"05101 - MINISTÉRIO PÚBLICO DO ESTADO DO ESPÍRITO SANTO",".","5 - DEFESA NACIONAL","091 – Defesa da Ordem Jurídica","05101"," - ","MINISTÉRIO PÚBLICO DO ESTADO DO ESPÍRITO SANTO"]
[19,"-",{"$f":"CONCATENATE(Tabela2[[#This Row],[Código do Programa]],Tabela2[[#This Row],[Colunas1]],Tabela2[[#This Row],[Nome do Programa2]])","v":"19-GESTÃO E ASSESSORAMENTO GOVERNAMENTAL"},"GESTÃO E ASSESSORAMENTO GOVERNAMENTAL","GESTÃO PÚBLICA INOVADORA","ÓRGÃOS PÚBLICOS ESTADUAIS","PRESTAR ASSESSORIA, APOIO E INFRAESTRUTURA NECESSÁRIA ÀS ATIVIDADES DOS GABINETES DO GOVERNADOR, VICE GOVERNADOR E ÀS SECRETARIAS EXTRAORDINÁRIAS PARA CUMPRIMENTO DE SUAS FUNÇÕES E COMPETÊNCIAS.","EM ANDAMENTO",19101,"10 - GOVERNADORIA DO ESTADO \n","GABINETE DO VICE-GOVERNADOR",".",null,null,null,null,"Metro",null,null,null,"05901 - FUNDO ESTADUAL DE REPARAÇÃO DE INTERESSES DIFUSOS LESADOS",".","6 - SEGURANÇA PÚBLICA","092 – Representação Judicial e Extrajudicial","05901"," - ","FUNDO ESTADUAL DE REPARAÇÃO DE INTERESSES DIFUSOS LESADOS"]
[23,"-",{"$f":"CONCATENATE(Tabela2[[#This Row],[Código do Programa]],Tabela2[[#This Row],[Colunas1]],Tabela2[[#This Row],[Nome do Programa2]])","v":"23-JUSTIÇA ACESSÍVEL COM SOLUÇÃO DE DEMANDAS EFETIVA, ADEQUADA E EM TEMPO RAZOÁVEL"},"JUSTIÇA ACESSÍVEL COM SOLUÇÃO DE DEMANDAS EFETIVA, ADEQUADA E EM TEMPO RAZOÁVEL","PODERES","INDIVÍDUOS E ORGANIZAÇÕES DA SOCIEDADE QUE BUSCAM A TUTELA JURISDICIONAL","ASSEGURAR A TODOS, INDISTINTAMENTE, A SOLUÇÃO ADEQUADA DOS CONFLITOS APRESENTADOS À JUSTIÇA CAPIXABA DE FORMA ACESSÍVEL, CÉLERE E EFETIVA, CONTRIBUINDO PARA A PROMOÇÃO DA PAZ SOCIAL E PARA O FORTALECIMENTO DO ESTADO DEMOCRÁTICO DE DIREITO.","EM ANDAMENTO",3101,"03 -  PODER JUDICIÁRIO DO ESTADO DO ESPÍRITO SANTO","TRIBUNAL DE JUSTIÇA DO ESTADO DO ESPÍRITO SANTO",".",null,null,null,null,"Percentual",null,null,null,"05902 - FUNDO ESPECIAL DO MINISTÉRIO PÚBLICO DO ESTADO DO ESPÍRITO SANTO",".","7 - RELAÇÕES EXTERIORES","121 – Planejamento e Orçamento","05902"," - ","FUNDO ESPECIAL DO MINISTÉRIO PÚBLICO DO ESTADO DO ESPÍRITO SANTO"]
[24,"-",{"$f":"CONCATENATE(Tabela2[[#This Row],[Código do Programa]],Tabela2[[#This Row],[Colunas1]],Tabela2[[#This Row],[Nome do Programa2]])","v":"24-EXERCÍCIO DA FUNÇÃO CONSTITUCIONAL E DO CONTROLE SOCIAL"},"EXERCÍCIO DA FUNÇÃO CONSTITUCIONAL E DO CONTROLE SOCIAL","PODERES","INTEGRANTES E SETORES DA SOCIEDADE QUE ESTEJAM COM SEUS DIREITOS EM RISCO","GARANTIR E APRIMORAR A ATUAÇÃO MINISTERIAL, JUDICIAL E EXTRAJUDICIAL, NA DEFESA DA ORDEM JURÍDICA, DO REGIME DEMOCRÁTICO E DOS DIREITOS SOCIAIS INDIVIDUAIS INDISPONÍVEIS.","EM ANDAMENTO",5101,"05 - MINISTÉRIO PÚBLICO DO ESTADO DO ESPÍRITO SANTO \n","MINISTÉRIO PÚBLICO DO ESTADO DO ESPÍRITO SANTO",".",null,null,null,null,"Por Mil",null,null,null,"06101 - DEFENSORIA PÚBLICA DO ESTADO DO ESPÍRITO SANTO",".","8 - ASSISTÊNCIA SOCIAL","122 – Administração Geral","06101"," - ","DEFENSORIA PÚBLICA DO ESTADO DO ESPÍRITO SANTO"]
[26,"-",{"$f":"CONCATENATE(Tabela2[[#This Row],[Código do Programa]],Tabela2[[#This Row],[Colunas1]],Tabela2[[#This Row],[Nome do Programa2]])","v":"26-INCLUIR"},"INCLUIR","DESENVOLVIMENTO SOCIAL E DIREITOS HUMANOS","DESEMPREGADOS E FAMÍLIAS EM SITUAÇÃO DE POBREZA E EXTREMA POBREZA","REDUZIR A POBREZA, PROMOVENDO A INCLUSÃO SOCIAL, A CIDADANIA, O EMPREGO E A EMANCIPAÇÃO DAS FAMÍLIAS CAPIXABAS QUE SE ENCONTREM EM CONDIÇÃO DE EXTREMA VULNERABILIDADE SOCIOECONÔMICA.","EM ANDAMENTO",47101,"47 - SECRETARIA DE ESTADO DE TRABALHO, ASSISTÊNCIA E DESENVOLVIMENTO SOCIAL \n","SECRETARIA DE ESTADO DE TRABALHO, ASSISTÊNCIA E DESENVOLVIMENTO SOCIAL",".",null,null,null,null,"Tonelada",null,null,null,"06901 - FUNDO DE APARELHAMENTO DA DEFENSORIA PÚBLICA",".","9 - PREVIDÊNCIA SOCIAL","123 – Administração Financeira","06901"," - ","FUNDO DE APARELHAMENTO DA DEFENSORIA PÚBLICA"]
[27,"-",{"$f":"CONCATENATE(Tabela2[[#This Row],[Código do Programa]],Tabela2[[#This Row],[Colunas1]],Tabela2[[#This Row],[Nome do Programa2]])","v":"27-GESTÃO ESTRATÉGICA DE PESSOAS"},"GESTÃO ESTRATÉGICA DE PESSOAS","GESTÃO PÚBLICA INOVADORA","SERVIDORES PÚBLICOS ESTADUAIS","PROPICIAR A IMPLEMENTAÇÃO E A EXECUÇÃO DA POLÍTICA DE GESTÃO DE PESSOAS NO PODER EXECUTIVO ESTADUAL.","EM ANDAMENTO",31201,"28 - SECRETARIA DE ESTADO DE GESTÃO E RECURSOS HUMANOS \n","INSTITUTO DE DEFESA AGROPECUÁRIA E FLORESTAL DO ESPÍRITO SANTO",".",null,null,null,null,"Unidade",null,null,null,"10101 - SECRETARIA DA CASA CIVIL",".","10 - SAÚDE","124 – Controle Interno","10101"," - ","SECRETARIA DA CASA CIVIL"]
[32,"-",{"$f":"CONCATENATE(Tabela2[[#This Row],[Código do Programa]],Tabela2[[#This Row],[Colunas1]],Tabela2[[#This Row],[Nome do Programa2]])","v":"32-GESTÃO E SUPORTE EDUCACIONAL"},"GESTÃO E SUPORTE EDUCACIONAL","EDUCAÇÃO PARA O FUTURO","PROFISSIONAIS DA EDUCAÇÃO E ESCOLAS","REALIZAR SUPORTE ÀS ATIVIDADES DE PLANEJAMENTO, GESTÃO E EXECUÇÃO DAS POLÍTICAS EDUCACIONAIS, PROPORCIONANDO CONDIÇÕES ADEQUADAS DE FUNCIONAMENTO DAS UNIDADES ESCOLARES E DE ATENDIMENTO AOS ESTUDANTES.","EM ANDAMENTO",42101,"42 -  SECRETARIA DE ESTADO DA EDUCAÇÃO \n","SECRETARIA DE ESTADO DA EDUCAÇÃO",".",null,null,null,null,null,null,null,null,"10102 - SECRETARIA DA CASA MILITAR",".","11 - TRABALHO","125 – Normatização e Fiscalização","10102"," - ","SECRETARIA DA CASA MILITAR"]
[33,"-",{"$f":"CONCATENATE(Tabela2[[#This Row],[Código do Programa]],Tabela2[[#This Row],[Colunas1]],Tabela2[[#This Row],[Nome do Programa2]])","v":"33-MELHORIA DA QUALIDADE DO ENSINO E DA APRENDIZAGEM NA REDE PÚBLICA COM EQUIDADE"},"MELHORIA DA QUALIDADE DO ENSINO E DA APRENDIZAGEM NA REDE PÚBLICA COM EQUIDADE","EDUCAÇÃO PARA O FUTURO","ALUNOS DAS REDES PÚBLICAS ESTADUAL E MUNICIPAIS DE ENSINO","ELEVAR O NÍVEL DE APRENDIZAGEM, GARANTIR O ACESSO, REDUZIR OS ÍNDICES DE ABANDONO E EVASÃO, DIMINUIR AS DESIGUALDADES EDUCACIONAIS NAS REDES PÚBLICAS ESTADUAL E MUNICIPAIS DE MODO A ALCANÇAR AS METAS DO PLANO ESTADUAL DE EDUCAÇÃO.","EM ANDAMENTO",42101,"42 -  SECRETARIA DE ESTADO DA EDUCAÇÃO \n","SECRETARIA DE ESTADO DA EDUCAÇÃO",".",null,null,null,null,null,null,null,null,"10103 - SECRETARIA DE ESTADO DE CONTROLE E TRANSPARÊNCIA",".","12 - EDUCAÇÃO","126 – Tecnologia da Informação","10103"," - ","SECRETARIA DE ESTADO DE CONTROLE E TRANSPARÊNCIA"]
[35,"-",{"$f":"CONCATENATE(Tabela2[[#This Row],[Código do Programa]],Tabela2[[#This Row],[Colunas1]],Tabela2[[#This Row],[Nome do Programa2]])","v":"35-ES MAIS SUSTENTÁVEL"},"ES MAIS SUSTENTÁVEL","DESENVOLVIMENTO ECONÔMICO","EMPREENDEDORES E ENTES PÚBLICOS","MELHORAR A COMPETITIVIDADE, O AMBIENTE DE NEGÓCIOS E DE INOVAÇÃO DE FORMA A APRIMORAR OS FATORES QUE INFLUENCIAM A ATRAÇÃO E AMPLIAÇÃO DOS INVESTIMENTOS, COM FOCO NA DIVERSIFICAÇÃO DA ECONOMIA ESTADUAL, NA REDUÇÃO DAS DESIGUALDADES REGIONAIS E NA SUSTENTABILIDADE.","EM ANDAMENTO",32204,"32 - SECRETARIA DE ESTADO DA CIÊNCIA, TECNOLOGIA, INOVAÇÃO, EDUCAÇÃO PROFISSIONAL E DESENVOLVIMENTO ECONONÔMICO\n","AGÊNCIA DE DESENVOLVIMENTO DAS MICRO E PEQUENAS EMPRESAS E DO EMPREENDEDORISMO",".",null,null,null,null,null,null,null,null,"10104 - SUPERINTENDÊNCIA ESTADUAL DE COMUNICAÇÃO SOCIAL",".","13 - CULTURA","127 – Ordenamento Territorial","10104"," - ","SUPERINTENDÊNCIA ESTADUAL DE COMUNICAÇÃO SOCIAL"]
[36,"-",{"$f":"CONCATENATE(Tabela2[[#This Row],[Código do Programa]],Tabela2[[#This Row],[Colunas1]],Tabela2[[#This Row],[Nome do Programa2]])","v":"36-FORÇA PELA VIDA"},"FORÇA PELA VIDA","SEGURANÇA EM DEFESA DA VIDA","PEDESTRES E USUÁRIOS DOS MEIOS DE TRANSPORTE RODOVIÁRIO","VALORIZAR A VIDA NO TRÂNSITO, POR MEIO DE ATIVIDADES DE EDUCAÇÃO, CONSCIENTIZAÇÃO, FISCALIZAÇÃO E PREVENÇÃO DE ACIDENTES NO TRÂNSITO A FIM DE REDUZIR O NÚMERO DE ACIDENTES.","EM ANDAMENTO",45202,"45 - SECRETARIA DE ESTADO DA SEGURANCA PÚBLICA E DEFESA SOCIAL \n","DEPARTAMENTO ESTADUAL DE TRÂNSITO",".",null,null,null,null,null,null,null,null,"10109 - SECRETARIA DE ESTADO DO GOVERNO",".","14 - DIREITOS DA CIDADANIA","128 – Formação de Recursos Humanos","10109"," - ","SECRETARIA DE ESTADO DO GOVERNO"]
[38,"-",{"$f":"CONCATENATE(Tabela2[[#This Row],[Código do Programa]],Tabela2[[#This Row],[Colunas1]],Tabela2[[#This Row],[Nome do Programa2]])","v":"38-VIDA NO CAMPO"},"VIDA NO CAMPO","AGRICULTURA E MEIO AMBIENTE","PRODUTORES RURAIS, PESCADORES E AQUICULTORES, PREFEITURAS MUNICIPAIS, ORGANIZAÇÕES PÚBLICAS E PRIVADAS","PROMOVER O DESENVOLVIMENTO SOCIAL E PRODUTIVO DO SETOR AGROPECUÁRIO, AQUÍCOLA E PESQUEIRO, COM OFERTA DE SERVIÇOS E INFRAESTRUTURA, AUMENTANDO A PRODUÇÃO E A PRODUTIVIDADE, A QUALIDADE, A RENTABILIDADE, COM AGREGAÇÃO DE VALOR, INOVAÇÃO E SUSTENTABILIDADE, ALÉM DA PROTEÇÃO DOS RECURSOS NATURAIS E DA SANIDADE VEGETAL E ANIMAL.","EM ANDAMENTO",31101,"31 - SECRETARIA DE ESTADO DA AGRICULTURA, ABASTECIMENTO, AQUICULTURA E PESCA \n","SECRETARIA DE ESTADO DA AGRICULTURA, ABASTECIMENTO, AQUICULTURA E PESCA",".",null,null,null,null,null,null,null,null,"10201 - RÁDIO E TELEVISÃO ESPÍRITO SANTO",".","15 - URBANISMO","129 – Administração de Receitas","10201"," - ","RÁDIO E TELEVISÃO ESPÍRITO SANTO"]
[39,"-",{"$f":"CONCATENATE(Tabela2[[#This Row],[Código do Programa]],Tabela2[[#This Row],[Colunas1]],Tabela2[[#This Row],[Nome do Programa2]])","v":"39-PROMOÇÃO, DEFESA E ATENDIMENTO DOS DIREITOS DA CRIANÇA E DO ADOLESCENTE"},"PROMOÇÃO, DEFESA E ATENDIMENTO DOS DIREITOS DA CRIANÇA E DO ADOLESCENTE","DESENVOLVIMENTO SOCIAL E DIREITOS HUMANOS","CRIANÇAS E ADOLESCENTES","FORMULAR POLÍTICAS DE PROMOÇÃO, DEFESA E ATENDIMENTO CONFORME O ESTATUTO DA CRIANÇA E DO ADOLESCENTE.","EM ANDAMENTO",48901,"47 - SECRETARIA DE ESTADO DE TRABALHO, ASSISTÊNCIA E DESENVOLVIMENTO SOCIAL \n","FUNDO PARA A INFÂNCIA E A ADOLESCÊNCIA ",".",null,null,"Gestor Responsável ",null,null,null,null,null,"10901 - FUNDO ESTADUAL SOBRE DROGAS (UO EXTINTA)",".","16 - HABITAÇÃO","130 – Administração de Concessões","10901"," - ","FUNDO ESTADUAL SOBRE DROGAS (UO EXTINTA)"]
[40,"-",{"$f":"CONCATENATE(Tabela2[[#This Row],[Código do Programa]],Tabela2[[#This Row],[Colunas1]],Tabela2[[#This Row],[Nome do Programa2]])","v":"40-PROMOÇÃO, PROTEÇÃO E DEFESA DOS DIREITOS HUMANOS"},"PROMOÇÃO, PROTEÇÃO E DEFESA DOS DIREITOS HUMANOS","DESENVOLVIMENTO SOCIAL E DIREITOS HUMANOS","VÍTIMAS DE PRECONCEITO, DISCRIMINAÇÃO, INTOLERÂNCIA, DESRESPEITO, ABUSOS, MAUS TRATOS, NEGLIGÊNCIA, ABANDONO E AMEAÇADAS DE MORTE","PROMOVER, PROTEGER E EFETIVAR OS DIREITOS HUMANOS, BUSCANDO EQUACIONAR OS MAIS GRAVES PROBLEMAS QUE IMPOSSIBILITAM OU DIFICULTAM A PLENA REALIZAÇÃO DO EXERCÍCIO DE CIDADANIA E A GARANTIA DOS DIREITOS HUMANOS.","EM ANDAMENTO",48902,"48 -  SECRETARIA DE ESTADO DE DIREITOS HUMANOS \n","FUNDO ESTADUAL DE DEFESA DOS DIREITOS DA PESSOA IDOSA",".",null,null,null,null,null,null,null,null,"10904 - FUNDO ESTADUAL DE COMBATE A CORRUPÇÃO ",".","17 - SANEAMENTO","131 – Comunicação Social","10904"," - ","FUNDO ESTADUAL DE COMBATE A CORRUPÇÃO "]
[41,"-",{"$f":"CONCATENATE(Tabela2[[#This Row],[Código do Programa]],Tabela2[[#This Row],[Colunas1]],Tabela2[[#This Row],[Nome do Programa2]])","v":"41-GESTÃO LEGISLATIVA "},"GESTÃO LEGISLATIVA ","PODERES","SOCIEDADE EM GERAL, PARLAMENTARES E SERVIDORES DA ASSEMBLEIA LEGISLATIVA","REPRESENTAR A SOCIEDADE, LEGISLAR, APURAR FATOS DETERMINADOS, EXERCER A FISCALIZAÇÃO DOS ATOS DO PODER EXECUTIVO, DESEMPENHAR AS DEMAIS PRERROGATIVAS CONSTITUCIONAIS, LEGAIS E REGIMENTAIS DO ÓRGÃO, BEM COMO DIVULGAR OS TRABALHOS REALIZADOS POR ESSA INSTITUIÇÃO E INCENTIVAR A PARTICIPAÇÃO POPULAR.  ","EM ANDAMENTO",1101,"01 - ASSEMBLEIA LEGISLATIVA DO ESTADO DO ESPÍRITO SANTO","ASSEMBLEIA LEGISLATIVA DO ESTADO DO ESPÍRITO SANTO",".",null,null,null,null,null,null,null,null,"10905 - FUNDO SOBRE DROGAS",".","18 - GESTÃO AMBIENTAL","151 – Defesa Aérea","10905"," - ","FUNDO SOBRE DROGAS"]
[42,"-",{"$f":"CONCATENATE(Tabela2[[#This Row],[Código do Programa]],Tabela2[[#This Row],[Colunas1]],Tabela2[[#This Row],[Nome do Programa2]])","v":"42-DEFENSORIA PARA TODOS"},"DEFENSORIA PARA TODOS","PODERES","PESSOAS NECESSITADAS E VULNERÁVEIS","PROVER A FUNÇÃO JURISDICIONAL DO ESTADO ÀS PESSOAS NECESSITADAS E VULNERÁVEIS, INCUMBINDO-LHE, COMO EXPRESSÃO E INSTRUMENTO DO REGIME DEMOCRÁTICO, A ORIENTAÇÃO E A ASSISTÊNCIA JUDICIAL E EXTRAJUDICIAL, A PROMOÇÃO DOS DIREITOS HUMANOS E A DEFESA, EM TODOS OS GRAUS, DOS DIREITOS INDIVIDUAIS E COLETIVOS, DE FORMA INTEGRAL E GRATUITA.","EM ANDAMENTO",6101,"06 - DEFENSORIA PÚBLICA DO ESTADO DO ESPÍRITO SANTO","DEFENSORIA PÚBLICA DO ESTADO DO ESPÍRITO SANTO",".",null,null,null,null,null,null,null,null,"16101 - PROCURADORIA GERAL DO ESTADO",".","19 - CIÊNCIA E TECNOLOGIA","152 – Defesa Naval","16101"," - ","PROCURADORIA GERAL DO ESTADO"]
{"$rows_left_out":117}